Home > Cannot Find > Maven Cannot Find Symbol Build Error

Maven Cannot Find Symbol Build Error


Show that the square matrix A is invertible Is adding the ‘tbl’ prefix to table names really a problem? But when I ... Share This Page Tweet Your name or email address: Do you already have an account? Why is the 'You talking to me' speech from the movie 'Taxi Driver' so famous? this page

Someone peeled an American flag sticker off of my truck. Subquestion: my goal is to have one entity service used by many different portlets, is this a sane approach? If I put first the scope compile and then the scope test it will fail. Drawing a torso with a head (using \draw) Build me a brick wall! pop over to these guys

Maven Cannot Find Symbol Dependency

Also a little more information on your setting could be useful: How is maven launched? I have also checked and verified the maven script and it is perfect. more hot questions question feed default about us tour help blog chat data legal privacy policy work here advertising info mobile contact us feedback Technology Life / Arts Culture / Recreation What is the most efficient & fastest way to speed up the installation of packages with thousands of items?

How can I take a powerful plot item away from players without frustrating them? One thing to note, is that this abstract class looks like the one abstract class used in the integration test. Mark as an Answer RE: Service builder "error: cannot find symbol" July 3, 2015 1:46 AM Answer Joel Peltonen Rank: Junior Member Posts: 28 Join Date: January 21, 2015 Recent Posts Jenkins Compilation Error Cannot Find Symbol However, I can manually compile PointOfContact.java within IDEA, and there are are no external dependencies.

All I could find is this page: maven.apache.org/plugins/maven-compiler-plugin/… Thanks. –Jared Beck Oct 27 '13 at 1:42 1 maven.apache.org/plugins/index.html –George Papatheodorou Nov 5 '13 at 13:20 add a comment| up vote Maven Compilation Error Package Does Not Exist Join them; it only takes a minute: Sign up maven compilation failure up vote 17 down vote favorite 11 I have a weird problem - Some class file couldn't be read Polyglot Anagrams Cops' Thread How to decline a postdoc interview if there is some possible future collaboration? http://stackoverflow.com/questions/29970729/maven-compile-cannot-find-symbol Then I found below.

Sign in to vote. Java Compile Error Cannot Find Symbol share|improve this answer edited Mar 4 '14 at 15:38 answered Feb 26 '14 at 12:15 Pelpotronic 35219 add a comment| up vote 0 down vote If your dependencies are fine (check share|improve this answer edited Jan 24 '12 at 8:33 mrnx 17.8k52642 answered Jul 1 '11 at 10:14 mulya 613719 tried this, still gives compilation error –user_mda Sep 30 '15 Newer Post Older Post Home Subscribe to: Post Comments ( Atom ) Articles les plus consultés Resolved : log4j:WARN No appenders could be found for logger (org.springframework.web.context.ContextLoader) I was using log4j

Maven Compilation Error Package Does Not Exist

Featured SitesMore Guild Wars 2 Guru Guild Wars 2 Guru The latest and greatest on Tyria. Does Intel sell CPUs in ribbons? Maven Cannot Find Symbol Dependency Are you following the canonical Maven directory structure? Maven Compile Error Symbol Not Found Found it, Thank you so much!

kinda what Maven does. this website Bystrup Jan 4 '13 at 20:26 More information provided. –mattg Jan 4 '13 at 20:34 Add a code snippet please (the line around the error) –asgoth Jan Linked 1 Maven cannot find symbol error with intern java files Related 211IntelliJ inspection gives “Cannot resolve symbol” but still compiles code0cannot find tag library descriptor for spring framework in maven kinda what Maven does. Maven Cannot Find Symbol Method

In the end, I will refactor and add all my portlets next to the service in one big portlet plugin project and now maven is happy to co-operate.Also apparently I should What is this line of counties voting for the Democratic party in the 2016 elections? US Election results 2016: What went wrong with prediction models? Get More Info thepaperboy99, 17, 2013 #5 (You must log in or sign up to reply here.) Show Ignored Content Thread Status: Not open for further replies.

Terms and Rules Curse Enjoy the game Not a Member? Maven Compilation Failure more stack exchange communities company blog Stack Exchange Inbox Reputation and Badges sign up log in tour help Tour Start here for a quick overview of the site Help Center Detailed A good example is available here : https://weblogs.java.net/blog/carcassi/archive/2011/04/21/running-integration-tests-and-unit-tests-separately-maven share|improve this answer answered Apr 28 '14 at 21:25 Melou 1994 Thanks for the tip.

In my case, I couldn't create the portlet in the same place as the services.

Although there was a version for the managed dependency defined in parent pom, Maven was unable to resolve it and was complaining about missing version in the dependent pom.xml So I FAILURE [ 28.205 s] [INFO] openmrs-web ....................................... Jason Jaikiran Pai Marshal Posts: 10447 227 I like... Jenkins Maven Cannot Find Symbol posted 7 years ago Please post the entire console logs of "mvn package" and also post the relevant parts from the two source files.

Look closely; the information you're looking for is most likely in the following line. How to delete the lines from a file that do not contain dot? SKIPPED [INFO] —---------------------------------------------------------------------- [INFO] BUILD FAILURE [INFO] —---------------------------------------------------------------------- [INFO] Total time: 36.714 s [INFO] Finished at: 2016-03-05T10:53:27+05:45 [INFO] Final Memory: 33M/210M [INFO] —---------------------------------------------------------------------- [ERROR] Failed to execute goal org.apache.maven.plugins:maven-compiler-plugin:2.1:compile (default-compile) on http://bestimageweb.com/cannot-find/java-cannot-find-symbol-error.php Resolution Maven's best practice is to use the build-helper-maven-plugin to add alternate source directories, instead of using in the maven-compiler-plugin.

project -pom.xml -common-module --src, pom.xml, etc -web-module --src, pom.xml, etc (but dependent on 'common') mvn install would run fine for common-module but gives compilation error for web-module code that uses java The first, PointOfContact.java, is a simple bean containing 4 String fields. I know i have seen similar issues like this in the past. –Jose Martinez Apr 30 '15 at 15:11 | show 3 more comments 1 Answer 1 active oldest votes up Browse other questions tagged java maven compiler-errors settings or ask your own question.

Can Trump undo the UN climate change agreement? Is there a word for being sad about knowing that the things that make you happy will eventually go away C++ calculator using classes Zener diodes in glass axial package - Jboss EAP 6 : Remote Access to Admin Console and T... share|improve this answer answered Jan 4 '13 at 20:26 Isaac 11.4k23058 2 Nope, that's not it.

Error: [INFO] Compiling 137 source files to V:\dhs_tss_build_view\dhs_tssproject\tss\tsscommon-server\target\classes [INFO] ------------------------------------------------------------------------ [ERROR] BUILD FAILURE [INFO] ------------------------------------------------------------------------ [INFO] Compilation failure V:/dhs_tss_build_view/dhs_tssproject/tss/tsscommon-server/src/main/java/us/mn/state/dhs/tss/common/oblix/da/wsdl/OblixLoginAc cess.java:[51,60] cannot find symbol symbol : class BusinessException location: class us.mn.state.dhs.tss.common.oblix.da.wsdl.OblixLoginAccess V:/dhs_tss_build_view/dhs_tssproject/tss/tsscommon-server/src/main/java/us/mn/state/dhs/tss/common/app/da/ldap/BaseLdapImpl.j what command? Sign in to vote. In my case it is not.

java maven compiler-errors settings share|improve this question edited Jan 4 '13 at 20:38 asked Jan 4 '13 at 20:23 mattg 7811514 Can you provide some version information (Maven in I was using JDK 8 + Maven 3.2.5, but in pom compiler lever is set to 7. If already installed check your $JAVA_HOME environment variable, it should contain the path of Java JDK 8. test: This scope indicates that the dependency is not required for normal use of the application, and is only available for the test compilation and execution phases.

current community chat Stack Overflow Meta Stack Overflow your communities Sign up or log in to customize your list.